Reaction Details
TargetCarbonic anhydrase 6
LigandBDBM50303495
Substrate/Competitorn/a
Meas. Tech.ChEMBL_595955 (CHEMBL1044457)
Ki 6600±n/a nM
Citation Maresca, ATemperini, CPochet, LMasereel, BScozzafava, ASupuran, CT Deciphering the mechanism of carbonic anhydrase inhibition with coumarins and thiocoumarins. J Med Chem53:335-44 (2010) 
 
Carbonic anhydrase 6
Name:Carbonic anhydrase 6
Type:Enzyme
Mol. Mass.:35371.40
Organism:Homo sapiens (Human)
Description:P23280
Residue:308
BDBM50303495
NameBDBM50303495
Synonyms:CHEMBL568385 | ethyl 7-methoxy-2-oxo-2H-chromene-3-carboxylate
TypeSmall organic molecule
Emp. Form.C13H12O5
Mol. Mass.248.2314
SMILESCCOC(=O)c1cc2ccc(OC)cc2oc1=O