Reaction Details
TargetCarbonic anhydrase 6
LigandBDBM50303488
Substrate/Competitorn/a
Meas. Tech.ChEMBL_595955 (CHEMBL1044457)
Ki 54700±n/a nM
Citation Maresca, ATemperini, CPochet, LMasereel, BScozzafava, ASupuran, CT Deciphering the mechanism of carbonic anhydrase inhibition with coumarins and thiocoumarins. J Med Chem53:335-44 (2010) 
 
Carbonic anhydrase 6
Name:Carbonic anhydrase 6
Type:Enzyme
Mol. Mass.:35371.40
Organism:Homo sapiens (Human)
Description:P23280
Residue:308
BDBM50303488
NameBDBM50303488
Synonyms:6-methyl-2-oxo-2H-chromene-3-carboxylic acid | CHEMBL577123
TypeSmall organic molecule
Emp. Form.C11H8O4
Mol. Mass.204.1788
SMILESCc1ccc2oc(=O)c(cc2c1)C(O)=O