Reaction Details
TargetCarbonic anhydrase 6
LigandBDBM50303501
Substrate/Competitorn/a
Meas. Tech.ChEMBL_595955 (CHEMBL1044457)
Ki 7400±n/a nM
Citation Maresca, ATemperini, CPochet, LMasereel, BScozzafava, ASupuran, CT Deciphering the mechanism of carbonic anhydrase inhibition with coumarins and thiocoumarins. J Med Chem53:335-44 (2010) 
 
Carbonic anhydrase 6
Name:Carbonic anhydrase 6
Type:Enzyme
Mol. Mass.:35371.40
Organism:Homo sapiens (Human)
Description:P23280
Residue:308
BDBM50303501
NameBDBM50303501
Synonyms:7-propoxy-2H-chromen-2-one | CHEMBL568516
TypeSmall organic molecule
Emp. Form.C12H12O3
Mol. Mass.204.2219
SMILESCCCOc1ccc2ccc(=O)oc2c1