Reaction Details
TargetCarbonic anhydrase 6
LigandBDBM50303500
Substrate/Competitorn/a
Meas. Tech.ChEMBL_595955 (CHEMBL1044457)
Ki 82300±n/a nM
Citation Maresca, ATemperini, CPochet, LMasereel, BScozzafava, ASupuran, CT Deciphering the mechanism of carbonic anhydrase inhibition with coumarins and thiocoumarins. J Med Chem53:335-44 (2010) 
 
Carbonic anhydrase 6
Name:Carbonic anhydrase 6
Type:Enzyme
Mol. Mass.:35371.40
Organism:Homo sapiens (Human)
Description:P23280
Residue:308
BDBM50303500
NameBDBM50303500
Synonyms:7-ethoxy-2H-1-benzopyran-2-one CHEMBL191528 | Ethylumbelliferone
TypeSmall organic molecule
Emp. Form.C11H10O3
Mol. Mass.190.1953
SMILESCCOc1ccc2ccc(=O)oc2c1