Reaction Details
TargetCarbonic anhydrase 5B, mitochondrial
LigandBDBM50303499
Substrate/Competitorn/a
Meas. Tech.ChEMBL_595954 (CHEMBL1044456)
Ki>500000±n/a nM
Citation Maresca, ATemperini, CPochet, LMasereel, BScozzafava, ASupuran, CT Deciphering the mechanism of carbonic anhydrase inhibition with coumarins and thiocoumarins. J Med Chem53:335-44 (2010) 
 
Carbonic anhydrase 5B, mitochondrial
Name:Carbonic anhydrase 5B, mitochondrial
Type:Enzyme
Mol. Mass.:36440.83
Organism:Homo sapiens (Human)
Description:Human (cloned) isozyme
Residue:317
BDBM50303499
NameBDBM50303499
Synonyms:7-(methyloxy)-2H-chromen-2-one 7-methoxy-2H-1-benzopyran-2-one CHEMBL49732 Herniarine | Methylumbelliferone
TypeSmall organic molecule
Emp. Form.C10H8O3
Mol. Mass.176.1687
SMILESCOc1ccc2ccc(=O)oc2c1