Reaction Details
TargetCarbonic anhydrase 5A, mitochondrial
LigandBDBM50303498
Substrate/Competitorn/a
Meas. Tech.ChEMBL_595953 (CHEMBL1044455)
Ki 8500±n/a nM
Citation Maresca, ATemperini, CPochet, LMasereel, BScozzafava, ASupuran, CT Deciphering the mechanism of carbonic anhydrase inhibition with coumarins and thiocoumarins. J Med Chem53:335-44 (2010) 
 
Carbonic anhydrase 5A, mitochondrial
Name:Carbonic anhydrase 5A, mitochondrial
Type:Enzyme
Mol. Mass.:34755.54
Organism:Homo sapiens (Human)
Description:Human (cloned) isozyme
Residue:305
BDBM50303498
NameBDBM50303498
Synonyms:1-(2-Oxo-2H-chromen-6-ylmethyl)-3,5,7-triaza-1-azonia-tricyclo[3.3.1.1*3,7*]decane | CHEMBL578167
TypeSmall organic molecule
Emp. Form.C16H19N4O2
Mol. Mass.299.3471
SMILESO=c1ccc2cc(C[N+]34CN5CN(CN(C5)C3)C4)ccc2o1