Reaction Details
TargetCarbonic anhydrase 5A, mitochondrial
LigandBDBM50303496
Substrate/Competitorn/a
Meas. Tech.ChEMBL_595953 (CHEMBL1044455)
Ki 4700±n/a nM
Citation Maresca, ATemperini, CPochet, LMasereel, BScozzafava, ASupuran, CT Deciphering the mechanism of carbonic anhydrase inhibition with coumarins and thiocoumarins. J Med Chem53:335-44 (2010) 
 
Carbonic anhydrase 5A, mitochondrial
Name:Carbonic anhydrase 5A, mitochondrial
Type:Enzyme
Mol. Mass.:34755.54
Organism:Homo sapiens (Human)
Description:Human (cloned) isozyme
Residue:305
BDBM50303496
NameBDBM50303496
Synonyms:6-(hydroxymethyl)-2H-chromen-2-one | CHEMBL571738
TypeSmall organic molecule
Emp. Form.C10H8O3
Mol. Mass.176.1687
SMILESOCc1ccc2oc(=O)ccc2c1