Reaction Details
TargetCarbonic anhydrase 4
LigandBDBM50303497
Substrate/Competitorn/a
Meas. Tech.ChEMBL_595952 (CHEMBL1044454)
Ki 15000±n/a nM
Citation Maresca, ATemperini, CPochet, LMasereel, BScozzafava, ASupuran, CT Deciphering the mechanism of carbonic anhydrase inhibition with coumarins and thiocoumarins. J Med Chem53:335-44 (2010) 
 
Carbonic anhydrase 4
Name:Carbonic anhydrase 4
Type:Enzyme
Mol. Mass.:35037.98
Organism:Homo sapiens (Human)
Description:P22748
Residue:312
BDBM50303497
NameBDBM50303497
Synonyms:6-(aminomethyl)-2H-chromen-2-one | CHEMBL567139
TypeSmall organic molecule
Emp. Form.C10H9NO2
Mol. Mass.175.184
SMILESNCc1ccc2oc(=O)ccc2c1