Reaction Details
TargetCarbonic anhydrase 4
LigandBDBM50303494
Substrate/Competitorn/a
Meas. Tech.ChEMBL_595952 (CHEMBL1044454)
Ki 9100±n/a nM
Citation Maresca, ATemperini, CPochet, LMasereel, BScozzafava, ASupuran, CT Deciphering the mechanism of carbonic anhydrase inhibition with coumarins and thiocoumarins. J Med Chem53:335-44 (2010) 
 
Carbonic anhydrase 4
Name:Carbonic anhydrase 4
Type:Enzyme
Mol. Mass.:35037.98
Organism:Homo sapiens (Human)
Description:P22748
Residue:312
BDBM50303494
NameBDBM50303494
Synonyms:CHEMBL568173 | ethyl 6-(hydroxymethyl)-2-oxo-2H-chromene-3-carboxylate
TypeSmall organic molecule
Emp. Form.C13H12O5
Mol. Mass.248.2314
SMILESCCOC(=O)c1cc2cc(CO)ccc2oc1=O