Reaction Details
TargetPteridine reductase 1
LigandBDBM50303504
Substrate/Competitorn/a
Meas. Tech.ChEMBL_596055 (CHEMBL1037349)
Ki 240±n/a nM
Citation Tulloch, LBMartini, VPIulek, JHuggan, JKLee, JHGibson, CLSmith, TKSuckling, CJHunter, WN Structure-based design of pteridine reductase inhibitors targeting African sleeping sickness and the leishmaniases. J Med Chem53:221-9 (2010) 
 
Pteridine reductase 1
Name:Pteridine reductase 1
Type:PROTEIN
Mol. Mass.:30459.34
Organism:Leishmania major
Description:ChEMBL_1470027
Residue:288
BDBM50303504
NameBDBM50303504
Synonyms:2,4-diamino-6,7-diisopropylpteridin-1-ium CHEMBL568202
TypeSmall organic molecule
Emp. Form.C12H18N6
Mol. Mass.246.3115
SMILESCC(C)c1nc2nc(N)nc(N)c2nc1C(C)C