Reaction Details
TargetPteridine reductase 1
LigandBDBM50303505
Substrate/Competitorn/a
Meas. Tech.ChEMBL_596055 (CHEMBL1037349)
Ki 12000±n/a nM
Citation Tulloch, LBMartini, VPIulek, JHuggan, JKLee, JHGibson, CLSmith, TKSuckling, CJHunter, WN Structure-based design of pteridine reductase inhibitors targeting African sleeping sickness and the leishmaniases. J Med Chem53:221-9 (2010) 
 
Pteridine reductase 1
Name:Pteridine reductase 1
Type:PROTEIN
Mol. Mass.:30459.34
Organism:Leishmania major
Description:ChEMBL_1470027
Residue:288
BDBM50303505
NameBDBM50303505
Synonyms:6,7,7-trimethyl-7,8-dihydropteridine-2,4-diamine | CHEMBL566271
TypeSmall organic molecule
Emp. Form.C9H14N6
Mol. Mass.206.2477
SMILESCC1=Nc2c(N)nc(N)nc2NC1(C)C