Reaction Details
TargetPteridine reductase 1
LigandBDBM50303506
Substrate/Competitorn/a
Meas. Tech.ChEMBL_596055 (CHEMBL1037349)
Ki>27000±n/a nM
Citation Tulloch, LBMartini, VPIulek, JHuggan, JKLee, JHGibson, CLSmith, TKSuckling, CJHunter, WN Structure-based design of pteridine reductase inhibitors targeting African sleeping sickness and the leishmaniases. J Med Chem53:221-9 (2010) 
 
Pteridine reductase 1
Name:Pteridine reductase 1
Type:PROTEIN
Mol. Mass.:30459.34
Organism:Leishmania major
Description:ChEMBL_1470027
Residue:288
BDBM50303506
NameBDBM50303506
Synonyms:2-amino-3H-pyrrolo[2,3-d]pyrimidine-4(7H)-thione | CHEMBL566272
TypeSmall organic molecule
Emp. Form.C6H6N4S
Mol. Mass.166.204
SMILESNc1nc2[nH]ccc2c(=S)[nH]1