Reaction Details
TargetPteridine reductase 1
LigandBDBM50303514
Substrate/Competitorn/a
Meas. Tech.ChEMBL_596055 (CHEMBL1037349)
Ki 2600±n/a nM
Citation Tulloch, LBMartini, VPIulek, JHuggan, JKLee, JHGibson, CLSmith, TKSuckling, CJHunter, WN Structure-based design of pteridine reductase inhibitors targeting African sleeping sickness and the leishmaniases. J Med Chem53:221-9 (2010) 
 
Pteridine reductase 1
Name:Pteridine reductase 1
Type:PROTEIN
Mol. Mass.:30459.34
Organism:Leishmania major
Description:ChEMBL_1470027
Residue:288
BDBM50303514
NameBDBM50303514
Synonyms:2-amino-6-(1,3-benzodioxol-5-yl)-4-oxo-4,7-dihydro-3H-pyrrolo[2,3-d]pyrimidine-5-carbonitrile CHEMBL568414
TypeSmall organic molecule
Emp. Form.C14H9N5O3
Mol. Mass.295.253
SMILESNc1nc2[nH]c(c(C#N)c2c(=O)[nH]1)-c1ccc2OCOc2c1