Reaction Details
TargetProtein kinase C alpha type
LigandBDBM50378568
Substrate/Competitorn/a
Meas. Tech.ChEMBL_597777 (CHEMBL1046255)
IC50 1300±n/a nM
Citation Moy, FJLee, AGavrin, LKXu, ZBSievers, AKieras, EStochaj, WMosyak, LMcKew, JTsao, DH Novel synthesis and structural characterization of a high-affinity paramagnetic kinase probe for the identification of non-ATP site binders by nuclear magnetic resonance. J Med Chem53:1238-49 (2010) 
 
Protein kinase C alpha type
Name:Protein kinase C alpha type
Type:Enzyme
Mol. Mass.:76755.65
Organism:Homo sapiens (Human)
Description:The recombinant human PKC enzymes were produced using a baculovirus expression system in SF9 cells
Residue:672
BDBM50378568
NameBDBM50378568
Synonyms:CHEMBL1163016
TypeSmall organic molecule
Emp. Form.C28H31N6O3
Mol. Mass.499.5841
SMILESCC1(C)CC(CC(C)(C)N1[O])NC(=O)c1cccc(c1)-c1cc2nccc(Nc3cccc(O)c3)n2n1