Reaction Details
TargetTyrosine-protein kinase Fyn
LigandBDBM50378568
Substrate/Competitorn/a
Meas. Tech.ChEMBL_597767 (CHEMBL1046245)
IC50 5±n/a nM
Citation Moy, FJLee, AGavrin, LKXu, ZBSievers, AKieras, EStochaj, WMosyak, LMcKew, JTsao, DH Novel synthesis and structural characterization of a high-affinity paramagnetic kinase probe for the identification of non-ATP site binders by nuclear magnetic resonance. J Med Chem53:1238-49 (2010) 
 
Tyrosine-protein kinase Fyn
Name:Tyrosine-protein kinase Fyn
Type:Enzyme
Mol. Mass.:60762.21
Organism:Homo sapiens (Human)
Description:P06241
Residue:537
BDBM50378568
NameBDBM50378568
Synonyms:CHEMBL1163016
TypeSmall organic molecule
Emp. Form.C28H31N6O3
Mol. Mass.499.5841
SMILESCC1(C)CC(CC(C)(C)N1[O])NC(=O)c1cccc(c1)-c1cc2nccc(Nc3cccc(O)c3)n2n1