Reaction Details
TargetGlucocorticoid receptor
LigandBDBM50303831
Substrate/Competitorn/a
Meas. Tech.ChEMBL_594763 (CHEMBL1039873)
Ki 1±n/a nM
Citation Xiao, HYWu, DRMalley, MFGougoutas, JZHabte, SFCunningham, MDSomerville, JEDodd, JHBarrish, JCNadler, SGDhar, TG Novel synthesis of the hexahydroimidazo[1,5b]isoquinoline scaffold: application to the synthesis of glucocorticoid receptor modulators. J Med Chem53:1270-80 (2010) 
 
Glucocorticoid receptor
Name:Glucocorticoid receptor
Type:Enzyme
Mol. Mass.:85656.87
Organism:Homo sapiens (Human)
Description:P04150
Residue:777
BDBM50303831
NameBDBM50303831
Synonyms:3-((S)-1-((5aR,6S)-1-(4-fluorophenyl)-5a-methyl-5,5a,6,7,8,9-hexahydroimidazo[1,5-b]isoquinolin-6-yl)-1-hydroxyethyl)benzonitrile | CHEMBL566600
TypeSmall organic molecule
Emp. Form.C27H26FN3O
Mol. Mass.427.5132
SMILESC[C@](O)([C@H]1CCCC2=Cc3c(ncn3C[C@]12C)-c1ccc(F)cc1)c1cccc(c1)C#N