Reaction Details
TargetGlucocorticoid receptor
LigandBDBM50303834
Substrate/Competitorn/a
Meas. Tech.ChEMBL_594766 (CHEMBL1039876)
EC50 920±n/a nM
Citation Xiao, HYWu, DRMalley, MFGougoutas, JZHabte, SFCunningham, MDSomerville, JEDodd, JHBarrish, JCNadler, SGDhar, TG Novel synthesis of the hexahydroimidazo[1,5b]isoquinoline scaffold: application to the synthesis of glucocorticoid receptor modulators. J Med Chem53:1270-80 (2010) 
 
Glucocorticoid receptor
Name:Glucocorticoid receptor
Type:Enzyme
Mol. Mass.:85656.87
Organism:Homo sapiens (Human)
Description:P04150
Residue:777
BDBM50303834
NameBDBM50303834
Synonyms:Benzo[b]thiophen-3-yl(1-(4-fluorophenyl)-5a-methyl-5,5a ,6,7,8,9-hexahydroimidazo[1,5-b]isoquinolin-6-yl)methanol Benzo[b]thiophen-3-yl(1-(4-fluorophenyl)-5a-methyl-5,5a,6,7,8,9-hexahydroimidazo[1,5-b]isoquinolin-6-yl)methanol | CHEMBL569543
TypeSmall organic molecule
Emp. Form.C27H25FN2OS
Mol. Mass.444.564
SMILESCC12Cn3cnc(c3C=C1CCCC2C(O)c1csc2ccccc12)-c1ccc(F)cc1