Reaction Details
TargetIntegrin alpha-5/beta-1
LigandBDBM50378570
Substrate/Competitorn/a
Meas. Tech.ChEMBL_595003 (CHEMBL1039861)
IC50 24±n/a nM
Citation Gentilucci, LCardillo, GSpampinato, STolomelli, ASquassabia, FDe Marco, RBedini, ABaiula, MBelvisi, LCivera, M Antiangiogenic effect of dual/selective alpha(5)beta(1)/alpha(v)beta(3) integrin antagonists designed on partially modified retro-inverso cyclotetrapeptide mimetics. J Med Chem53:106-18 (2010) 
 
Integrin alpha-5/beta-1
Name:Integrin alpha-5/beta-1
Type:Enzyme
Mol. Mass.:n/a
Description:n/a
Components:This complex has 2 components.
Component 1
Name:Integrin alpha-5
Synonyms:CD49 antigen-like family member E FNRA Fibronectin receptor subunit alpha ITGA5 Integrin alpha-F | VLA-5
Type:Single-pass type I membrane protein
Mol. Mass.:114523.00
Organism:Homo sapiens (Human)
Description:n/a
Residue:1049
Component 2
Name:Integrin beta-1
Synonyms:CD_antigen=CD29 Fibronectin receptor beta GPIIA ITGB1 MDF2 | MSK12
Type:Enzyme
Mol. Mass.:88400.38
Organism:Homo sapiens (Human)
Description:P05556
Residue:798
BDBM50378570
NameBDBM50378570
Synonyms:CHEMBL572085
TypeSmall organic molecule
Emp. Form.C22H31N7O6
Mol. Mass.489.5248
SMILES[#7]\[#6](-[#7])=[#7]\[#6]-[#6]-[#6]-[#6@@H]-1-[#7]-[#6](=O)-[#6]-[#6](=O)-[#7]-[#6@@H](-[#6]-[#6](-[#8])=O)-[#6](=O)-[#7]-[#6@H](-[#6]-c2ccccc2)-[#6]-[#7]-[#6]-1=O