Reaction Details
TargetIndoleamine 2,3-dioxygenase 1
LigandBDBM50303907
Substrate/Competitorn/a
Meas. Tech.ChEMBL_595173 (CHEMBL1040015)
IC50 20000±n/a nM
Citation Röhrig, UFAwad, LGrosdidier, ALarrieu, PStroobant, VColau, DCerundolo, VSimpson, AJVogel, PVan den Eynde, BJZoete, VMichielin, O Rational design of indoleamine 2,3-dioxygenase inhibitors. J Med Chem53:1172-89 (2010) 
 
Indoleamine 2,3-dioxygenase 1
Name:Indoleamine 2,3-dioxygenase 1
Type:PROTEIN
Mol. Mass.:45639.39
Organism:Mus musculus
Description:ChEMBL_1452149
Residue:407
BDBM50303907
NameBDBM50303907
Synonyms:2,3-dihydrobenzo[d]thiazole-2-thiol | CHEMBL570797
TypeSmall organic molecule
Emp. Form.C7H7NS2
Mol. Mass.169.267
SMILESSC1Nc2ccccc2S1