Reaction Details
TargetType-1 angiotensin II receptor A
LigandBDBM50303976
Substrate/Competitorn/a
Meas. Tech.ChEMBL_595237 (CHEMBL1043589)
Ki 1618±n/a nM
Citation Mizuno, CSChittiboyina, AGShah, FHPatny, AKurtz, TWPershadsingh, HASpeth, RCKaramyan, VTCarvalho, PBAvery, MA Design, synthesis, and docking studies of novel benzimidazoles for the treatment of metabolic syndrome. J Med Chem53:1076-85 (2010) 
 
Type-1 angiotensin II receptor A
Name:Type-1 angiotensin II receptor A
Type:Enzyme Catalytic Domain
Mol. Mass.:40910.53
Organism:RAT
Description:ANGIOTENSIN AT1 AGTR1 RAT::P25095
Residue:359
BDBM50303976
NameBDBM50303976
Synonyms:3'-(2-(4-(2-(1H-Tetrazol-5-yl)ethyl)phenoxy)ethyl)-1,7'-dimethyl-2'-propyl-1H,3'H-2,5'-bibenzo[d]imidazole | CHEMBL567898
TypeSmall organic molecule
Emp. Form.C30H32N8O
Mol. Mass.520.6281
SMILESCCCc1nc2c(C)cc(cc2n1CCOc1ccc(CCc2nnn[nH]2)cc1)-c1nc2ccccc2n1C