Reaction Details
TargetType-1 angiotensin II receptor A
LigandBDBM50303979
Substrate/Competitorn/a
Meas. Tech.ChEMBL_595237 (CHEMBL1043589)
Ki 2534±n/a nM
Citation Mizuno, CSChittiboyina, AGShah, FHPatny, AKurtz, TWPershadsingh, HASpeth, RCKaramyan, VTCarvalho, PBAvery, MA Design, synthesis, and docking studies of novel benzimidazoles for the treatment of metabolic syndrome. J Med Chem53:1076-85 (2010) 
 
Type-1 angiotensin II receptor A
Name:Type-1 angiotensin II receptor A
Type:Enzyme Catalytic Domain
Mol. Mass.:40910.53
Organism:RAT
Description:ANGIOTENSIN AT1 AGTR1 RAT::P25095
Residue:359
BDBM50303979
NameBDBM50303979
Synonyms:CHEMBL571763 | Ethyl 3-(4-(2-(1,7'-Dimethyl-2'-propyl-1H,3'H-2,5'-bibenzo-[d]imidazol-3'-yl)ethoxy)-phenyl)-2-methyl-2-phenoxypropanoate
TypeSmall organic molecule
Emp. Form.C39H42N4O4
Mol. Mass.630.7752
SMILESCCCc1nc2c(C)cc(cc2n1CCOc1ccc(CC(C)(Oc2ccccc2)C(=O)OCC)cc1)-c1nc2ccccc2n1C