Reaction Details
TargetType-1 angiotensin II receptor A
LigandBDBM50303982
Substrate/Competitorn/a
Meas. Tech.ChEMBL_595237 (CHEMBL1043589)
Ki>10000±n/a nM
Citation Mizuno, CSChittiboyina, AGShah, FHPatny, AKurtz, TWPershadsingh, HASpeth, RCKaramyan, VTCarvalho, PBAvery, MA Design, synthesis, and docking studies of novel benzimidazoles for the treatment of metabolic syndrome. J Med Chem53:1076-85 (2010) 
 
Type-1 angiotensin II receptor A
Name:Type-1 angiotensin II receptor A
Type:Enzyme Catalytic Domain
Mol. Mass.:40910.53
Organism:RAT
Description:ANGIOTENSIN AT1 AGTR1 RAT::P25095
Residue:359
BDBM50303982
NameBDBM50303982
Synonyms:CHEMBL567689 | Methyl 3-(4-((4-Methyl-2-propyl-1H-benzo[d]imidazol-1-yl)-methyl)phenyl)-propanoate
TypeSmall organic molecule
Emp. Form.C23H28N2O2
Mol. Mass.364.4806
SMILESCCCc1nc2c(C)cccc2n1Cc1ccc(CCC(=O)OCC)cc1