Reaction Details
TargetType-1 angiotensin II receptor A
LigandBDBM50303985
Substrate/Competitorn/a
Meas. Tech.ChEMBL_595237 (CHEMBL1043589)
Ki>10000±n/a nM
Citation Mizuno, CSChittiboyina, AGShah, FHPatny, AKurtz, TWPershadsingh, HASpeth, RCKaramyan, VTCarvalho, PBAvery, MA Design, synthesis, and docking studies of novel benzimidazoles for the treatment of metabolic syndrome. J Med Chem53:1076-85 (2010) 
 
Type-1 angiotensin II receptor A
Name:Type-1 angiotensin II receptor A
Type:Enzyme Catalytic Domain
Mol. Mass.:40910.53
Organism:RAT
Description:ANGIOTENSIN AT1 AGTR1 RAT::P25095
Residue:359
BDBM50303985
NameBDBM50303985
Synonyms:CHEMBL567269 | Ethyl 2,2-Dimethyl-3-(4-(2-(4-methyl-2-propyl-1H-benzo[d]-imidazol-1-yl)ethoxy)-phenyl)pro-panoate
TypeSmall organic molecule
Emp. Form.C26H34N2O3
Mol. Mass.422.5598
SMILESCCCc1nc2c(C)cccc2n1CCOc1ccc(CC(C)(C)C(=O)OCC)cc1