Reaction Details
Target5-hydroxytryptamine receptor 6
LigandBDBM86428
Substrate/Competitorn/a
Meas. Tech.ChEMBL_595424 (CHEMBL1040065)
Ki 0.75±n/a nM
Citation de la Fuente, TMartín-Fontecha, MSallander, JBenhamú, BCampillo, MMedina, RAPellissier, LPClaeysen, SDumuis, APardo, LLópez-Rodríguez, ML Benzimidazole derivatives as new serotonin 5-HT6 receptor antagonists. Molecular mechanisms of receptor inactivation. J Med Chem53:1357-69 (2010) 
 
5-hydroxytryptamine receptor 6
Name:5-hydroxytryptamine receptor 6
Type:Enzyme Catalytic Domain
Mol. Mass.:47012.98
Organism:MOUSE
Description:5-HT6 HTR6 MOUSE::Q9R1C8
Residue:440
BDBM86428
NameBDBM86428
Synonyms:SB-258585
TypeSmall organic molecule
Emp. Form.C18H22IN3O3S
Mol. Mass.487.355
SMILESCOc1ccc(NS(=O)(=O)c2ccc(I)cc2)cc1N1CCN(C)CC1