Reaction Details
Target5-hydroxytryptamine receptor 6
LigandBDBM50303988
Substrate/Competitorn/a
Meas. Tech.ChEMBL_595421 (CHEMBL1040062)
Ki>1000±n/a nM
Citation de la Fuente, TMartín-Fontecha, MSallander, JBenhamú, BCampillo, MMedina, RAPellissier, LPClaeysen, SDumuis, APardo, LLópez-Rodríguez, ML Benzimidazole derivatives as new serotonin 5-HT6 receptor antagonists. Molecular mechanisms of receptor inactivation. J Med Chem53:1357-69 (2010) 
 
5-hydroxytryptamine receptor 6
Name:5-hydroxytryptamine receptor 6
Type:G Protein-Coupled Receptor (GPCR)
Mol. Mass.:46968.43
Organism:Homo sapiens (Human)
Description:P50406
Residue:440
BDBM50303988
NameBDBM50303988
Synonyms:2-Benzyl-5-(4-methylpiperazin-1-yl)-1H-benzimidazole | CHEMBL568330
TypeSmall organic molecule
Emp. Form.C19H22N4
Mol. Mass.306.4048
SMILESCN1CCN(CC1)c1ccc2nc(Cc3ccccc3)[nH]c2c1