Reaction Details
Target5-hydroxytryptamine receptor 7
LigandBDBM50304004
Substrate/Competitorn/a
Meas. Tech.ChEMBL_595422 (CHEMBL1040063)
Ki>500±n/a nM
Citation de la Fuente, TMartín-Fontecha, MSallander, JBenhamú, BCampillo, MMedina, RAPellissier, LPClaeysen, SDumuis, APardo, LLópez-Rodríguez, ML Benzimidazole derivatives as new serotonin 5-HT6 receptor antagonists. Molecular mechanisms of receptor inactivation. J Med Chem53:1357-69 (2010) 
 
5-hydroxytryptamine receptor 7
Name:5-hydroxytryptamine receptor 7
Type:G Protein-Coupled Receptor (GPCR)
Mol. Mass.:53573.08
Organism:Homo sapiens (Human)
Description:P34969
Residue:479
BDBM50304004
NameBDBM50304004
Synonyms:5-(4-Methylpiperazin-1-yl)-2-(1-naphthylmethyl)-1H-benzimidazole | CHEMBL571764
TypeSmall organic molecule
Emp. Form.C23H24N4
Mol. Mass.356.4635
SMILESCN1CCN(CC1)c1ccc2nc(Cc3cccc4ccccc34)[nH]c2c1