Reaction Details
TargetKappa-type opioid receptor
LigandBDBM50304176
Substrate/Competitorn/a
Meas. Tech.ChEMBL_601121 (CHEMBL1074536)
EC50>10000±n/a nM
Citation Ghirmai, SAzar, MRCashman, JR Synthesis and pharmacological evaluation of 6-naltrexamine analogs for alcohol cessation. Bioorg Med Chem17:6671-81 (2009) 
 
Kappa-type opioid receptor
Name:Kappa-type opioid receptor
Type:G Protein-Coupled Receptor (GPCR)
Mol. Mass.:42648.76
Organism:Homo sapiens (Human)
Description:P41145
Residue:380
BDBM50304176
NameBDBM50304176
Synonyms:17-Cyclopropylmethyl-3,14beta-dihydroxy-4,5alpha-epoxy-6beta-[(4'-trimethylfluoro)benzamido]morphinan-oxalate | CHEMBL611929
TypeSmall organic molecule
Emp. Form.C28H29F3N2O4
Mol. Mass.514.5361
SMILESOc1ccc2C[C@H]3N(CC4CC4)CC[C@@]45[C@@H](Oc1c24)[C@@H](CC[C@@]35O)NC(=O)c1ccc(cc1)C(F)(F)F