Reaction Details
TargetKappa-type opioid receptor
LigandBDBM50304172
Substrate/Competitorn/a
Meas. Tech.ChEMBL_601121 (CHEMBL1074536)
EC50 0.400000±n/a nM
Citation Ghirmai, SAzar, MRCashman, JR Synthesis and pharmacological evaluation of 6-naltrexamine analogs for alcohol cessation. Bioorg Med Chem17:6671-81 (2009) 
 
Kappa-type opioid receptor
Name:Kappa-type opioid receptor
Type:G Protein-Coupled Receptor (GPCR)
Mol. Mass.:42648.76
Organism:Homo sapiens (Human)
Description:P41145
Residue:380
BDBM50304172
NameBDBM50304172
Synonyms:17-Cyclopropylmethyl-3,14beta-dihydroxy-4,5alpha-epoxy-6beta-[(4'-t-butyl)benzamido]morphinan-oxalate | CHEMBL611932
TypeSmall organic molecule
Emp. Form.C31H38N2O4
Mol. Mass.502.6444
SMILESCC(C)(C)c1ccc(cc1)C(=O)N[C@@H]1CC[C@@]2(O)[C@H]3Cc4ccc(O)c5O[C@@H]1[C@]2(CCN3CC1CC1)c45