Reaction Details
TargetNociceptin receptor
LigandBDBM50304171
Substrate/Competitorn/a
Meas. Tech.ChEMBL_601090 (CHEMBL1072487)
Ki>10000±n/a nM
Citation Ghirmai, SAzar, MRCashman, JR Synthesis and pharmacological evaluation of 6-naltrexamine analogs for alcohol cessation. Bioorg Med Chem17:6671-81 (2009) 
 
Nociceptin receptor
Name:Nociceptin receptor
Type:G Protein-Coupled Receptor (GPCR)
Mol. Mass.:40702.87
Organism:Homo sapiens (Human)
Description:P41146
Residue:370
BDBM50304171
NameBDBM50304171
Synonyms:17-Cyclopropylmethyl-3,14beta-dihydroxy-4,5alpha-epoxy-6beta-[(4'-iodo)benzamido]morphinan-oxalate | CHEMBL611931
TypeSmall organic molecule
Emp. Form.C27H29IN2O4
Mol. Mass.572.4346
SMILESOc1ccc2C[C@H]3N(CC4CC4)CC[C@@]45[C@@H](Oc1c24)[C@@H](CC[C@@]35O)NC(=O)c1ccc(I)cc1