Reaction Details
TargetProcathepsin L
LigandBDBM50304288
Substrate/Competitorn/a
Meas. Tech.ChEMBL_605778 (CHEMBL1074596)
Ki 2100±n/a nM
Citation Micale, NEttari, RSchirmeister, TEvers, AGelhaus, CLeippe, MZappalà, MGrasso, S Novel 2H-isoquinolin-3-ones as antiplasmodial falcipain-2 inhibitors. Bioorg Med Chem17:6505-11 (2009) 
 
Procathepsin L
Name:Procathepsin L
Type:Enzyme
Mol. Mass.:37557.19
Organism:Homo sapiens (Human)
Description:Purchased from Calbiochem (San Diego, CA).
Residue:333
BDBM50304288
NameBDBM50304288
Synonyms:2-(4-Acetylphenylureido)-1-(4-methoxyphenyl)-6,7-methylenedioxy-2H-isoquinolin-3-one | CHEMBL594623
TypeSmall organic molecule
Emp. Form.C26H21N3O6
Mol. Mass.471.4614
SMILESCOc1ccc(cc1)-c1n(NC(=O)Nc2ccc(cc2)C(C)=O)c(=O)cc2cc3OCOc3cc12