Reaction Details
TargetSialidase
LigandBDBM50304348
Substrate/Competitorn/a
Meas. Tech.ChEMBL_606760 (CHEMBL1065350)
IC50 6100±n/a nM
Citation Jeong, HJRyu, YBPark, SJKim, JHKwon, HJKim, JHPark, KHRho, MCLee, WS Neuraminidase inhibitory activities of flavonols isolated from Rhodiola rosea roots and their in vitro anti-influenza viral activities. Bioorg Med Chem17:6816-23 (2009) 
 
Sialidase
Name:Sialidase
Type:PROTEIN
Mol. Mass.:42808.79
Organism:Clostridium perfringens
Description:ChEMBL_991336
Residue:382
BDBM50304348
NameBDBM50304348
Synonyms:CHEMBL594871 | Rhodiolinin
TypeSmall organic molecule
Emp. Form.C25H20O10
Mol. Mass.480.4203
SMILESCOc1cc(ccc1O)[C@H]1Oc2cc(O)c3c(oc(c(O)c3=O)-c3ccc(O)cc3)c2O[C@@H]1CO