Reaction Details
TargetSialidase
LigandBDBM26655
Substrate/Competitorn/a
Meas. Tech.ChEMBL_606760 (CHEMBL1065350)
IC50 800±n/a nM
Citation Jeong, HJRyu, YBPark, SJKim, JHKwon, HJKim, JHPark, KHRho, MCLee, WS Neuraminidase inhibitory activities of flavonols isolated from Rhodiola rosea roots and their in vitro anti-influenza viral activities. Bioorg Med Chem17:6816-23 (2009) 
 
Sialidase
Name:Sialidase
Type:PROTEIN
Mol. Mass.:42808.79
Organism:Clostridium perfringens
Description:ChEMBL_991336
Residue:382
BDBM26655
NameBDBM26655
Synonyms:2-(3,4-dihydroxyphenyl)-3,5,7,8-tetrahydroxy-4H-chromen-4-one Gossypetin (23) | gossypetin
TypeFlavonoid
Emp. Form.C15H10O8
Mol. Mass.318.2351
SMILESOc1ccc(cc1O)-c1oc2c(O)c(O)cc(O)c2c(=O)c1O