Reaction Details
TargetSialidase
LigandBDBM7460
Substrate/Competitorn/a
Meas. Tech.ChEMBL_606760 (CHEMBL1065350)
IC50 1700±n/a nM
Citation Jeong, HJRyu, YBPark, SJKim, JHKwon, HJKim, JHPark, KHRho, MCLee, WS Neuraminidase inhibitory activities of flavonols isolated from Rhodiola rosea roots and their in vitro anti-influenza viral activities. Bioorg Med Chem17:6816-23 (2009) 
 
Sialidase
Name:Sialidase
Type:PROTEIN
Mol. Mass.:42808.79
Organism:Clostridium perfringens
Description:ChEMBL_991336
Residue:382
BDBM7460
NameBDBM7460
Synonyms:2-(3,4-dihydroxyphenyl)-3,5,7-trihydroxy-4H-chromen-4-one 2-(3,4-dihydroxyphenyl)-3,5,7-trihydroxy-chromone;hydrate Quercetin Quercetin (21) US11021454, Compound Quercetin med.21724, Compound 4
TypeSmall organic molecule
Emp. Form.C15H10O7
Mol. Mass.302.2357
SMILESOc1cc(O)c2c(c1)oc(-c1ccc(O)c(O)c1)c(O)c2=O