Reaction Details
TargetSialidase
LigandBDBM7459
Substrate/Competitorn/a
Meas. Tech.ChEMBL_606760 (CHEMBL1065350)
IC50 4300±n/a nM
Citation Jeong, HJRyu, YBPark, SJKim, JHKwon, HJKim, JHPark, KHRho, MCLee, WS Neuraminidase inhibitory activities of flavonols isolated from Rhodiola rosea roots and their in vitro anti-influenza viral activities. Bioorg Med Chem17:6816-23 (2009) 
 
Sialidase
Name:Sialidase
Type:PROTEIN
Mol. Mass.:42808.79
Organism:Clostridium perfringens
Description:ChEMBL_991336
Residue:382
BDBM7459
NameBDBM7459
Synonyms:2-(3,4-dihydroxyphenyl)-5,7-dihydroxy-4H-chromen-4-one CHEMBL151 Luteolin (4) cid_5280445 med.21724, Compound 3
TypeSmall organic molecule
Emp. Form.C15H10O6
Mol. Mass.286.2363
SMILESOc1cc(O)c2c(c1)oc(cc2=O)-c1ccc(O)c(O)c1