Reaction Details
TargetNAD-dependent protein deacetylase HST2
LigandBDBM50304355
Substrate/Competitorn/a
Meas. Tech.ChEMBL_606807 (CHEMBL1068571)
Ki 2500±n/a nM
Citation Sanders, BDJackson, BBrent, MTaylor, AMDang, WBerger, SLSchreiber, SLHowitz, KMarmorstein, R Identification and characterization of novel sirtuin inhibitor scaffolds. Bioorg Med Chem17:7031-41 (2009) 
 
NAD-dependent protein deacetylase HST2
Name:NAD-dependent protein deacetylase HST2
Type:PROTEIN
Mol. Mass.:39972.79
Organism:Saccharomyces cerevisiae
Description:ChEMBL_533704
Residue:357
BDBM50304355
NameBDBM50304355
Synonyms:3,4,6-trichloro-2-(2,5-dichloro-6-hydroxy-3-methylbenzyl)phenol | CHEMBL594863
TypeSmall organic molecule
Emp. Form.C14H9Cl5O2
Mol. Mass.386.485
SMILESCc1cc(Cl)c(O)c(Cc2c(O)c(Cl)cc(Cl)c2Cl)c1Cl