Reaction Details
TargetD(1B) dopamine receptor
LigandBDBM50180913
Substrate/Competitorn/a
Meas. Tech.ChEMBL_603134 (CHEMBL1038856)
Ki 1.5±n/a nM
Citation Schulze, MMüller, FKMason, JMGörls, HLehmann, JEnzensperger, C Dibenzazecine scaffold rebuilding--is the flexibility always essential for high dopamine receptor affinities? Bioorg Med Chem17:6898-907 (2009) 
 
D(1B) dopamine receptor
Name:D(1B) dopamine receptor
Type:Protein
Mol. Mass.:52943.41
Organism:Homo sapiens (Human)
Description:P21918
Residue:477
BDBM50180913
NameBDBM50180913
Synonyms:11-methyl-11-aza-tricyclo[12.4.0.0.3,8]octadeca-1(18),3(8),4,6,14,16-hexaen-6-ol 3-hydroxy-7-methyl-5,6,7,8,9,14-hexahydrodibenzo[d,g]azecine CHEMBL1204122 LE404
TypeSmall organic molecule
Emp. Form.C18H21NO
Mol. Mass.267.3654
SMILESCN1CCc2ccccc2Cc2ccc(O)cc2CC1