Reaction Details
TargetD(1B) dopamine receptor
LigandBDBM50378584
Substrate/Competitorn/a
Meas. Tech.ChEMBL_603134 (CHEMBL1038856)
Ki 4.4±n/a nM
Citation Schulze, MMüller, FKMason, JMGörls, HLehmann, JEnzensperger, C Dibenzazecine scaffold rebuilding--is the flexibility always essential for high dopamine receptor affinities? Bioorg Med Chem17:6898-907 (2009) 
 
D(1B) dopamine receptor
Name:D(1B) dopamine receptor
Type:Protein
Mol. Mass.:52943.41
Organism:Homo sapiens (Human)
Description:P21918
Residue:477
BDBM50378584
NameBDBM50378584
Synonyms:STEPHOLIDINE
TypeSmall organic molecule
Emp. Form.C19H21NO4
Mol. Mass.327.3743
SMILESCOc1cc2CCN3Cc4c(C[C@H]3c2cc1O)ccc(O)c4OC