Reaction Details
TargetAsialoglycoprotein receptor 1
LigandBDBM50077229
Substrate/Competitorn/a
Meas. Tech.ChEMBL_603826 (CHEMBL1042966)
Kd 1460000±n/a nM
Citation Stokmaier, DKhorev, OCutting, BBorn, RRicklin, DErnst, TOBöni, FSchwingruber, KGentner, MWittwer, MSpreafico, MVedani, ARabbani, SSchwardt, OErnst, B Design, synthesis and evaluation of monovalent ligands for the asialoglycoprotein receptor (ASGP-R). Bioorg Med Chem17:7254-64 (2009) 
 
Asialoglycoprotein receptor 1
Name:Asialoglycoprotein receptor 1
Type:PROTEIN
Mol. Mass.:33177.60
Organism:Homo sapiens (Human)
Description:ChEMBL_603824
Residue:291
BDBM50077229
NameBDBM50077229
Synonyms:CHEMBL300520 beta-D-galactose
TypeSmall organic molecule
Emp. Form.C6H12O6
Mol. Mass.180.1559
SMILESOC[C@H]1O[C@@H](O)[C@H](O)[C@@H](O)[C@H]1O