Reaction Details
TargetAsialoglycoprotein receptor 1
LigandBDBM50304487
Substrate/Competitorn/a
Meas. Tech.ChEMBL_603824 (CHEMBL1042964)
IC50 1828000±n/a nM
Citation Stokmaier, DKhorev, OCutting, BBorn, RRicklin, DErnst, TOBöni, FSchwingruber, KGentner, MWittwer, MSpreafico, MVedani, ARabbani, SSchwardt, OErnst, B Design, synthesis and evaluation of monovalent ligands for the asialoglycoprotein receptor (ASGP-R). Bioorg Med Chem17:7254-64 (2009) 
 
Asialoglycoprotein receptor 1
Name:Asialoglycoprotein receptor 1
Type:PROTEIN
Mol. Mass.:33177.60
Organism:Homo sapiens (Human)
Description:ChEMBL_603824
Residue:291
BDBM50304487
NameBDBM50304487
Synonyms:(2R,3R,4S,5S,6R)-2,3,4,5-tetramethoxy-6-(methoxymethyl)tetrahydro-2H-pyran | CHEMBL595499
TypeSmall organic molecule
Emp. Form.C11H22O6
Mol. Mass.250.2888
SMILESCOC[C@H]1O[C@@H](OC)[C@H](OC)[C@@H](OC)[C@H]1OC