Reaction Details
TargetAsialoglycoprotein receptor 1
LigandBDBM50240803
Substrate/Competitorn/a
Meas. Tech.ChEMBL_603824 (CHEMBL1042964)
IC50>30000000±n/a nM
Citation Stokmaier, DKhorev, OCutting, BBorn, RRicklin, DErnst, TOBöni, FSchwingruber, KGentner, MWittwer, MSpreafico, MVedani, ARabbani, SSchwardt, OErnst, B Design, synthesis and evaluation of monovalent ligands for the asialoglycoprotein receptor (ASGP-R). Bioorg Med Chem17:7254-64 (2009) 
 
Asialoglycoprotein receptor 1
Name:Asialoglycoprotein receptor 1
Type:PROTEIN
Mol. Mass.:33177.60
Organism:Homo sapiens (Human)
Description:ChEMBL_603824
Residue:291
BDBM50240803
NameBDBM50240803
Synonyms:CHEMBL1614854 beta-D-glucopyranose | beta-D-glucose
TypeSmall organic molecule
Emp. Form.C6H12O6
Mol. Mass.180.1559
SMILESOC[C@H]1O[C@@H](O)[C@H](O)[C@@H](O)[C@@H]1O