Reaction Details
TargetNeuronal acetylcholine receptor subunit alpha-7
LigandBDBM50278956
Substrate/Competitorn/a
Meas. Tech.ChEMBL_603582 (CHEMBL1071134)
Ki 11±n/a nM
Citation Mortell, KHSchrimpf, MRBunnelle, WHAnderson, DJGronlien, JHHagene, KTGopalakrishnan, M Structure-activity relationships of N-substituted ligands for the alpha7 nicotinic acetylcholine receptor. Bioorg Med Chem Lett20:104-7 (2010) 
 
Neuronal acetylcholine receptor subunit alpha-7
Name:Neuronal acetylcholine receptor subunit alpha-7
Type:Enzyme
Mol. Mass.:56502.44
Organism:Rattus norvegicus (Rat)
Description:Q05941
Residue:502
BDBM50278956
NameBDBM50278956
Synonyms:(3aR,6aS)-2-methyl-5-(6-phenylpyridazin-3-yl)octahydropyrrolo[3,4-c]pyrrole CHEMBL526281 | cis-2-(6-Phenyl-pyridazin-3-yl)-5-methyloctahydro-pyrrolo[3,4-c]-pyrrole
TypeSmall organic molecule
Emp. Form.C17H20N4
Mol. Mass.280.3675
SMILESCN1C[C@H]2CN(C[C@H]2C1)c1ccc(nn1)-c1ccccc1