Reaction Details
TargetNeuronal acetylcholine receptor subunit alpha-7
LigandBDBM50278955
Substrate/Competitorn/a
Meas. Tech.ChEMBL_603582 (CHEMBL1071134)
Ki 18±n/a nM
Citation Mortell, KHSchrimpf, MRBunnelle, WHAnderson, DJGronlien, JHHagene, KTGopalakrishnan, M Structure-activity relationships of N-substituted ligands for the alpha7 nicotinic acetylcholine receptor. Bioorg Med Chem Lett20:104-7 (2010) 
 
Neuronal acetylcholine receptor subunit alpha-7
Name:Neuronal acetylcholine receptor subunit alpha-7
Type:Enzyme
Mol. Mass.:56502.44
Organism:Rattus norvegicus (Rat)
Description:Q05941
Residue:502
BDBM50278955
NameBDBM50278955
Synonyms:CHEMBL506103 cis-2-(6-Phenyl-pyridazin-3-yl)-octahydro-pyrrolo[3,4-c]pyrrole Bis-trifluoroacetate
TypeSmall organic molecule
Emp. Form.C16H18N4
Mol. Mass.266.3409
SMILESC1NC[C@@H]2CN(C[C@H]12)c1ccc(nn1)-c1ccccc1