Reaction Details
TargetEnoyl-[acyl-carrier-protein] reductase [NADH] FabI
LigandBDBM50067040
Substrate/Competitorn/a
Meas. Tech.ChEMBL_603807 (CHEMBL1042945)
Ki 14960±n/a nM
Citation Yao, JZhang, QMin, JHe, JYu, Z Novel enoyl-ACP reductase (FabI) potential inhibitors of Escherichia coli from Chinese medicine monomers. Bioorg Med Chem Lett20:56-9 (2010) 
 
Enoyl-[acyl-carrier-protein] reductase [NADH] FabI
Name:Enoyl-[acyl-carrier-protein] reductase [NADH] FabI
Type:Enzyme
Mol. Mass.:27861.12
Organism:Escherichia coli
Description:n/a
Residue:262
BDBM50067040
NameBDBM50067040
Synonyms:((E,E)-1,7-bis(4-hydroxy-3-methoxyphenyl)-1,6-heptadiene-3,5-dione) (1E,4Z,6E)-5-hydroxy-1,7-bis(4-hydroxy-3-methoxyphenyl)hepta-1,4,6-trien-3-one (1E,6E)-1,7-bis(4-hydroxy-3-methoxyphenyl)-1,6-heptadiene-3,5-dione (1Z,6E)-1,7-Bis-(4-hydroxy-3-methoxy-phenyl)-hepta-1,6-diene-3,5-dione 1,7-Bis-(4-hydroxy-3-methoxy-phenyl)-hepta-1,6-diene-3,5-dione 1,7-bis(4-hydroxy-3-methoxyphenyl)-1,6-heptadiene-3,5-dione 1,7-bis(4-hydroxy-3-methoxyphenyl)hepta-1,6-diene-3,5-dione 5-Hydroxy-1,7-bis-(4-hydroxy-3-methoxy-phenyl)-hepta-1,4,6-trien-3-one CHEMBL116438 curcumin I curcurmin | diferuloylmethane
TypeSmall organic molecule
Emp. Form.C21H20O6
Mol. Mass.368.3799
SMILESCOc1cc(C=CC(=O)CC(=O)C=Cc2ccc(O)c(OC)c2)ccc1O