Reaction Details
TargetOxysterols receptor LXR-beta
LigandBDBM50305077
Substrate/Competitorn/a
Meas. Tech.ChEMBL_605690 (CHEMBL1071220)
IC50 2.4±n/a nM
Citation Singhaus, RRBernotas, RCSteffan, RMatelan, EQuinet, ENambi, PFeingold, IHuselton, CWilhelmsson, AGoos-Nilsson, AWrobel, J 3-(3-Aryloxyaryl)imidazo[1,2-a]pyridine sulfones as liver X receptor agonists. Bioorg Med Chem Lett20:521-5 (2010) 
 
Oxysterols receptor LXR-beta
Name:Oxysterols receptor LXR-beta
Type:Enzyme Catalytic Domain
Mol. Mass.:50978.79
Organism:Homo sapiens (Human)
Description:P55055
Residue:460
BDBM50305077
NameBDBM50305077
Synonyms:3-methyl-4-(3-(3-(methylsulfonyl)phenoxy)phenyl)-8-(trifluoromethyl)quinoline | CHEMBL595689
TypeSmall organic molecule
Emp. Form.C24H18F3NO3S
Mol. Mass.457.465
SMILESCc1cnc2c(cccc2c1-c1cccc(Oc2cccc(c2)S(C)(=O)=O)c1)C(F)(F)F