Reaction Details
TargetMyelin-associated glycoprotein
LigandBDBM50378603
Substrate/Competitorn/a
Meas. Tech.ChEMBL_611876 (CHEMBL1070831)
Kd 2400±n/a nM
Citation Mesch, SMoser, DStrasser, DSKelm, ACutting, BRossato, GVedani, AKoliwer-Brandl, HWittwer, MRabbani, SSchwardt, OKelm, SErnst, B Low molecular weight antagonists of the myelin-associated glycoprotein: synthesis, docking, and biological evaluation. J Med Chem53:1597-615 (2010) 
 
Myelin-associated glycoprotein
Name:Myelin-associated glycoprotein
Type:PROTEIN
Mol. Mass.:69368.91
Organism:Mus musculus
Description:ChEMBL_663794
Residue:627
BDBM50378603
NameBDBM50378603
Synonyms:CHEMBL600189
TypeSmall organic molecule
Emp. Form.C25H26ClF2N2O9
Mol. Mass.571.932
SMILESCC(=O)N[C@@H]1[C@@H](O)C[C@](OCc2cccc(F)c2F)(O[C@H]1[C@H](O)[C@@H](O)CNC(=O)c1ccc(Cl)cc1)C([O-])=O