Reaction Details
TargetCyclin-dependent kinase 2
LigandBDBM50306866
Substrate/Competitorn/a
Meas. Tech.ChEMBL_608662 (CHEMBL1067148)
IC50 5700±n/a nM
Citation Hegde, VRBorges, SPu, HPatel, MGullo, VPWu, BKirschmeier, PWilliams, MJMadison, VFischmann, TChan, TM Semi-synthetic aristolactams--inhibitors of CDK2 enzyme. Bioorg Med Chem Lett20:1384-7 (2010) 
 
Cyclin-dependent kinase 2
Name:Cyclin-dependent kinase 2
Type:Enzyme Subunit
Mol. Mass.:33938.17
Organism:Homo sapiens (Human)
Description:P24941
Residue:298
BDBM50306866
NameBDBM50306866
Synonyms:3,4,8-trihydroxy-10-nitrophenanthrene-1-carboxylic acid | CHEMBL599987
TypeSmall organic molecule
Emp. Form.C15H9NO7
Mol. Mass.315.2345
SMILESOC(=O)c1cc(O)c(O)c2c1c(cc1c(O)cccc21)[N+]([O-])=O