Reaction Details
TargetCyclin-dependent kinase 2
LigandBDBM50306878
Substrate/Competitorn/a
Meas. Tech.ChEMBL_608662 (CHEMBL1067148)
IC50>35000±n/a nM
Citation Hegde, VRBorges, SPu, HPatel, MGullo, VPWu, BKirschmeier, PWilliams, MJMadison, VFischmann, TChan, TM Semi-synthetic aristolactams--inhibitors of CDK2 enzyme. Bioorg Med Chem Lett20:1384-7 (2010) 
 
Cyclin-dependent kinase 2
Name:Cyclin-dependent kinase 2
Type:Enzyme Subunit
Mol. Mass.:33938.17
Organism:Homo sapiens (Human)
Description:P24941
Residue:298
BDBM50306878
NameBDBM50306878
Synonyms:8-Methoxy-6-methyl-6H-benzo[f][1,3]dioxolo[4',5':4,5]benzo[1,2,3-cd]indol-5-one | CHEMBL599313
TypeSmall organic molecule
Emp. Form.C18H13NO4
Mol. Mass.307.3001
SMILESCOc1cccc2c1cc1N(C)C(=O)c3cc4OCOc4c2c13