Reaction Details
TargetCyclin-dependent kinase 2
LigandBDBM50197847
Substrate/Competitorn/a
Meas. Tech.ChEMBL_608662 (CHEMBL1067148)
IC50>50000±n/a nM
Citation Hegde, VRBorges, SPu, HPatel, MGullo, VPWu, BKirschmeier, PWilliams, MJMadison, VFischmann, TChan, TM Semi-synthetic aristolactams--inhibitors of CDK2 enzyme. Bioorg Med Chem Lett20:1384-7 (2010) 
 
Cyclin-dependent kinase 2
Name:Cyclin-dependent kinase 2
Type:Enzyme Subunit
Mol. Mass.:33938.17
Organism:Homo sapiens (Human)
Description:P24941
Residue:298
BDBM50197847
NameBDBM50197847
Synonyms:CHEMBL387840 | crebanine
TypeSmall organic molecule
Emp. Form.C20H21NO4
Mol. Mass.339.385
SMILESCOc1ccc-2c(C[C@@H]3N(C)CCc4cc5OCOc5c-2c34)c1OC