Reaction Details
TargetVasopressin V1a receptor
LigandBDBM50307117
Substrate/Competitorn/a
Meas. Tech.ChEMBL_609634 (CHEMBL1067197)
EC50 14±n/a nM
Citation Frantz, MCRodrigo, JBoudier, LDurroux, TMouillac, BHibert, M Subtlety of the structure-affinity and structure-efficacy relationships around a nonpeptide oxytocin receptor agonist. J Med Chem53:1546-62 (2010) 
 
Vasopressin V1a receptor
Name:Vasopressin V1a receptor
Type:Receptor
Mol. Mass.:46820.18
Organism:Homo sapiens (Human)
Description:P37288
Residue:418
BDBM50307117
NameBDBM50307117
Synonyms:CHEMBL603708 | N-(4-(2,3,4,5-tetrahydro-1H-benzo[b]azepine-1-carbonyl)phenyl)biphenyl-2-carboxamide
TypeSmall organic molecule
Emp. Form.C30H26N2O2
Mol. Mass.446.5396
SMILESO=C(Nc1ccc(cc1)C(=O)N1CCCCc2ccccc12)c1ccccc1-c1ccccc1