Reaction Details
TargetALK tyrosine kinase receptor
LigandBDBM50307127
Substrate/Competitorn/a
Meas. Tech.ChEMBL_610306 (CHEMBL1071418)
IC50 18000±n/a nM
Citation Mologni, LRostagno, RBrussolo, SKnowles, PPKjaer, SMurray-Rust, JRosso, EZambon, AScapozza, LMcDonald, NQLucchini, VGambacorti-Passerini, C Synthesis, structure-activity relationship and crystallographic studies of 3-substituted indolin-2-one RET inhibitors. Bioorg Med Chem18:1482-96 (2010) 
 
ALK tyrosine kinase receptor
Name:ALK tyrosine kinase receptor
Type:Protein
Mol. Mass.:176453.10
Organism:Homo sapiens (Human)
Description:Q9UM73
Residue:1620
BDBM50307127
NameBDBM50307127
Synonyms:(3Z)-N,N-DIMETHYL-2-OXO-3-(4,5,6,7-TETRAHYDRO-1H-INDOL-2-YLMETHYLIDENE)-2,3-DIHYDRO-1H-INDOLE-5-SULFONAMIDE CHEMBL605003 SU-6656
TypeSmall organic molecule
Emp. Form.C19H21N3O3S
Mol. Mass.371.453
SMILESCN(C)S(=O)(=O)c1ccc2NC(=O)\C(=C/c3cc4CCCCc4[nH]3)c2c1